Articles of ubuntu

Android Studio работает только в консольном режиме на Ubuntu

У меня проблема с Android Studio на Ubuntu. До сих пор я использовал Android Studio в консольном режиме, перейдя в папку android-studio / bin и запустив studio.sh. Он работает хорошо, но мне скучно набирать команды каждый раз, когда я хочу его запустить, я бы предпочел открыть его, просто нажав на ярлык. Итак, я попытался создать […]

Как запустить Android-эмулятор от Shell на сервере Ubuntu

Я установил Android SDK и JDK на Ubuntu Server 14.04 x64. Но когда я запускаю AVD, я получил Ошибка: «Сбой инициализации SDL, причина в том, что нет доступного видеоустройства» Я следую этому https://stackoverflow.com/a/6965679 sudo apt-get install ia32-libs но не работал. Должен ли я устанавливать любой рабочий стол на сервере Ubuntu?

Ошибка android ndk-build на ubuntu 12.10 32 бит

Я загрузил последнюю версию Android ndk r8b на мою бета-версию ubuntu 12.10. Я включил каталог ndk в переменную PATH (когда я пишу ndk-b в терминале и нажимаю вкладку, она автоматически завершает его). Но когда я пытаюсь: Cd android-ndk / samples / san-angeles / jni NDK-сборки Я получаю эту ошибку: make: /home/mixpro/Android/android-ndk/toolchains/arm-linux-androideabi-4.6/prebuilt/linux-x86/bin/arm-linux-androideabi-gcc: Command not found make: […]

Нет такого файла или каталога при попытке получить версию adb

Я установил пакет Android adt для linux на свой компьютер (Ubuntu 13.04). Но теперь, когда я запускаю свое затмение в пакете adt, следующих за ошибками: 2014-11-04 13:25:50 – adb] Unexpected exception 'Cannot run program "/home/bharath/andriod/adt-bundle-linux-x86_64-20140702/sdk/platform-tools/adb": error=2, No such file or directory' while attempting to get adb version from '/home/bharath/andriod/adt-bundle-linux-x86_64-20140702/sdk/platform-tools/adb' Я также попытался выполнить следующие команды […]

Genymotion замораживает весь рабочий стол Ubuntu

Недавно я загрузил последнюю версию Genymotion, 2.7.2 (раньше у меня была предыдущая версия, я не помню, что именно), но всякий раз, когда я пытаюсь запустить эмулятор, устройство появляется примерно на минутку, но до полной загрузки оно зависает , Не только это, но когда это происходит, весь рабочий стол зависает. Я могу перемещать курсор, но больше […]

Android Studio – не удалось определить версию Java

Я установил новую копию Android Studio с помощью терминала, но когда я создаю новый проект, он дает ошибку «Не удалось определить версию Java». Установлены JDK и SDK. Android Studio обновляется до последней версии. Я использую Ubuntu 14.04 LTS Спасибо за помощь

Не удается запустить новый проект с Android Studio

Я только начал использовать Linux Ubuntu и загрузил и, возможно, настроил Android Studio. Когда я запускаю его, это происходит успешно, хотя на это уходило несколько часов. Но это дает мне сейчас: Your Android SDK is missing, out of date, or is missing templates. Please ensure you are using SDK version 22 or later. You can […]

Ошибка сборки студии Android на установке ubuntu

Недавно я установил студию Android на мою недавно установленную ОС ubuntu 14.10, я установил основной файл студии Android в папку моих документов, а затем загрузил и установил файл инструментов сборки sdk в папку с документами, а также связал эти два с помощью sdk в android Студия, я также загрузил все новейшие инструменты apis и build, […]

Android SDK установить прокси с ubuntu

Где я могу найти настройку прокси-сервера Android SDK? Я работаю с ubuntu, спасибо заранее. Все, что у меня есть, находится внизу экрана

Сбой сборки Gradle в Android Studio

Я использую Android Studio на Ubuntu. Я запустил Android Studio, создал «Новый проект» и начал его с Shift+F10 . Это привело к следующей ошибке: /home/laptop/AndroidStudioProjects/TestIt420/app/build/intermediates/exploded-aar/com.android.support/appcompat-v7/22.0.0/res/drawable-mdpi-v4/abc_btn_radio_to_on_mtrl_000.png Error:Error: com.android.ide.common.process.ProcessException: org.gradle.process.internal.ExecException: Process 'command '/home/laptop/Android/Sdk/build-tools/21.1.2/aapt'' finished with non-zero exit value 127 :app:mergeDebugResources FAILED FAILURE: Build failed with an exception. Run with –stacktrace option to get the stack trace. Run […]