Articles of build.gradle

Динамические версии (с использованием +) зависимостей в градусах

Я использую compile 'com.localytics.android:library:3.8+' в моем проекте. Я хочу знать, что последняя версия этой зависимости выбирается при создании apk release или каждый раз, когда пользователь открывает приложение (скачанное с игрового магазина).

Gradle не синхронизируется даже при первом запуске

Я установил последнюю версию Android Studio на Windows 10. (что я уже делал с другой версией и еще с Windows 10), все в порядке с Android SDK, но когда он хочет загрузить проект, он сказал следующее: Ошибка: (23, 17) Не удалось выполнить: junit: junit: 4.12 И вот журнал: JsonSyntaxException: исключение parse при чтении distributions.json: java.lang.IllegalStateException: […]

React Native приложение не запускается при использовании applicationIdSuffix

Я использую react-native-codepush@1.16.1-beta и часть настройки включает указание applicationIdSuffix. Я уже делал это в предыдущем приложении в прошлом без проблем (React Native 0.37). Я дважды сталкивался с этой ошибкой с этим проектом (React Native 0.40). В первый раз я перестроил весь свой проект, и он ушел. Это начало происходить снова без видимых причин, поэтому я […]

Gradle build fail с java 1.8, инструмент сборки 2.2.0-alpha4, включить jackOptions

Я строю андроид-проект с конфигурацией gradle ниже: Android Studio 2.1.2 Файл проекта: dependencies { classpath 'com.android.tools.build:gradle:2.2.0-alpha4' } Файл приложения: android { compileSdkVersion 24 buildToolsVersion '24.0.0' defaultConfig { applicationId "<my_app_id>" minSdkVersion 17 targetSdkVersion 24 versionCode 1 versionName "1.0" jackOptions { enabled true } } compileOptions { sourceCompatibility JavaVersion.VERSION_1_8 targetCompatibility JavaVersion.VERSION_1_8 } } Приложение всегда создает ошибку […]

App: ошибка mergeDebugResources в Android Studio после обновления

Я получаю сообщение об ошибке при создании / выполнении проекта Android Studio. Ошибка: : App: mergeDebugResources FAILED Ошибка: выполнение выполнено для задачи ': app: mergeDebugResources'. Некоторое сбой хэширования файла, см. Журналы для подробностей Я прошел через почту на SO и сделал следующее, чтобы исправить это, но я все еще не могу избавиться от ошибок. Чистый […]

Не удалось выполнить сборку с использованием распределения Gradle 'http://services.gradle.org/distributions/gradle-1.6-bin.zip'

В проекте Android есть ошибка, если проект построен: Ошибка в Android Studio: Gradle: Der Befehl "C:\Program" ist entweder falsch geschrieben oder konnte nicht gefunden werden. FAILURE: Build failed with an exception. * What went wrong: Execution failed for task ':MyApplication:dexDebug'. > Running C:\Users\Michael\AppData\Local\Android\android-studio\sdk\build-tools\android-4.2.2\dx.bat failed. See output * Try: Run with –stacktrace option to get the […]

Com.android.dex.DexException: несколько файлов dex определяют Landroid / support / annotation / AnimRes;

Привет, я работаю над проектом, для которого я использую Android Studio. У меня есть настройка всего, но когда я запускаю свой проект, я получаю ниже ошибок. Я не мог разрешить это за последние 2 дня. Что может быть проблемой в моем проекте, вызвавшей эту ошибку? Пожалуйста, помогите, если кто-нибудь знает об этом. App build.gradle apply […]

Как связать статические библиотеки (файлы .a) с APK с помощью графического плагина gradle 0.2.0 в Android Studio

В моем проекте есть две вещи. Я создаю статическую библиотеку, используя ndk-build Свяжите статическую библиотеку с существующим приложением в Android Studio. Написал много вопросов и попробовал много ответов. Но никто из них не работает для меня. Вот мои сомнения, Где на самом деле должны размещаться статические библиотеки ..? Как указать систему сборки Gradle, с которой […]

Ошибка градиента – выполнение выполнено для задачи: app: dexDebug '

Я пытаюсь добавить MPAndroidChartLibrary в мой проект Android Studio, однако, когда я пытаюсь запустить приложение, он продолжает терпеть неудачу с 1 ошибкой. Я не очень хорошо разбираюсь в граде, поэтому я действительно не знаю, что происходит не так. Мой файл градиента: apply plugin: 'com.android.application' android { compileSdkVersion 21 buildToolsVersion "21.0.2" defaultConfig { applicationId "com.bacon.corey.audiotimeshift" minSdkVersion […]

Проект не может быть скомпилирован после обновления до градиента: 2.1.0-alpha5

У меня есть проект Android, который отлично работал с версиями pre-gradle: 2.1.0-alpha3. Теперь он бросает такие ошибки, не имея понятия, как их разрешить: Error:Execution failed for task ':app:compileDebugJavaWithJavac'. > java.lang.NoSuchMethodError: com.google.common.collect.FluentIterable.append(Ljava/lang/Iterable;)Lcom/google/common/collect/FluentIterable; Это довольно странно, есть определенная ветка, которая в течение последних четырех или пяти дней также использовала для дублирования объектов в apk, подробности здесь Модуль […]