Articles of Android studio

Удалить прокладку в горизонтальном индикаторе выполнения

В нашем приложении нам нужен неопределенный индикатор выполнения, например: Мы можем добиться этого, установив отрицательный запас на ProgressBar, например: <ProgressBar android:id="@+id/progressbar" style="?android:attr/progressBarStyleHorizontal" android:layout_width="match_parent" android:layout_height="wrap_content" android:indeterminate="true" android:marginTop="-7dp" android:visibility="@{loading ? View.VISIBLE : View.GONE}" /> НО, потому что ConstraintLayout не поддерживает отрицательные поля, он будет выглядеть так: Хорошо, отрицательный запас был взломан. Давайте заменим его другим взломом, не […]

Как создать шаблонный проект для Android Studio

Я работаю с Android Studio. Я должен создавать много проектов с тремя модулями: Приложение (приложение) Библиотека (библиотека) Обои (приложение) Я знаю, что это возможно использовать ADT для создания Шаблонов активности и т. Д. Я нашел несколько учебников, подобных этому , но они говорят о шаблоне активности, без проекта с шаблоном модулей. Есть ли хороший учебник […]

Android Не удается получить доступ к org.apache.http.client.HttpClient

Я использую студию Android для создания приложения, которое делает запрос GET на сервер. Мой код: import org.apache.http.client.methods.CloseableHttpResponse; import org.apache.http.client.methods.HttpGetHC4; import org.apache.http.impl.client.CloseableHttpClient; import org.apache.http.impl.client.HttpClientBuilder; public class HTTPHelper { private String base; public HTTPHelper (String base) { this.base = base; } public String doGet (String path) { try { CloseableHttpClient client = HttpClientBuilder.create().build(); HttpGetHC4 get = new […]

Сбой сборки в студии Android

Я получаю эту ошибку, когда я делаю град онлайн. Error:Gradle: FAILURE: Build failed with an exception. * What went wrong: Task 'testClasses' not found in project ':ProwessPride_V1.01'. * Try: Run gradle tasks to get a list of available tasks. Run with –stacktrace option to get the stack trace. Run with –info or –debug option to […]

Дублирующиеся файлы, скопированные в APK Android. Могут ли они быть объединены?

В моем проекте Android я включил две библиотеки в виде JAR в папку libs. И я добавляю их к сборке Gradle, как показано ниже. dependencies { compile files('libs/siddhi-core-4.0.0-M13-SNAPSHOT.jar') compile files('libs/siddhi-execution-math-4.0.2-SNAPSHOT.jar') } Эти два файла jar имеют файл с тем же именем («org.wso2.siddhi.annotation.Extension»), но с другим контентом. И оба файла важны для проекта. Поскольку он имеет […]

Android-эмулятор для Android не запускается «Ожидание запуска целевого устройства онлайн»

Поэтому я сейчас изучаю, как разрабатывать приложения для Android. Я делаю свое первое приложение, и у меня нет ошибок, но мой эмулятор не запускает мое приложение. Он застрял на «Ожидание выхода целевого устройства в онлайн». Я смущен тем, что не так, потому что он работал раньше. Я полностью переустановил все, и он все еще не […]

Не удалось создать обучающие материалы GStreamer с помощью Android Studio

Я пытаюсь построить учебники, которые поставляются с gstreamer-sdk-android-arm-debug-2013.6 . Файл Android.mk каталоге src/jni (проект tutorial 1) ссылается на переменные окружения, такие как GSTREAMER_SDK_ROOT . Из того, что я прочитал, Android Studio не использует / пропускает переменные среды для скриптов сборки. Существует ли наилучшая практика для модификации make-файлов и для определения / получения пар ключ / […]

ViewPager + Picasso

Я создаю слайдер изображений с помощью Picasso + Viewpager. Я могу пронести ползунок по размеру (подсчету) изображения. Но изображения не загружены, и я могу прокрутить экран. Что не так с моими кодами? В моей MainActivity я получаю ссылки на мои изображения. Затем установите адаптер. viewPager = (ViewPager)findViewById(R.id.view_pager); viewPagerAdapter = new ViewPagerAdapter(MainActivity.this,IMAGES); viewPager.setAdapter(viewPagerAdapter); IMAGES = Массивы […]

Сбой сборки студии Android со следующей ошибкой

Error:Execution failed for task ':app:dexDebug'. > com.android.ide.common.process.ProcessException: org.gradle.process.internal.ExecException: Process 'command '/usr/lib/jvm/java-8-oracle/bin/java'' finished with non-zero exit value 2 Попробовали этот ответ Но моя проблема все еще не решена. Как я могу это решить?

ProcessException: ExecException: Process 'command' /Library/Java/JavaVirtualMachines/jdk1.8.0_31.jdk/Content/Home/bin/java

Я получаю исключение: Error:Execution failed for task ':app:dexDebug'. > com.android.ide.common.process.ProcessException: org.gradle.process.internal.ExecException: Process 'command '/Library/Java/JavaVirtualMachines/jdk1.8.0_31.jdk/Contents/Home/bin/java'' finished with non-zero exit value 2 После того, как я обновил сервисы Google Play до 7.5.0 : compile 'com.google.android.gms:play-services:7.5.0' Но если я изменю его на: compile 'com.google.android.gms:play-services:7.0.0' Все работает отлично, я также сталкиваюсь с той же проблемой, если я добавлю модуль […]