Не удалось скомпилировать мой Android-проект

Я пытаюсь скомпилировать версию для Android, но по какой-то причине он говорит, что есть ошибка, видимо, с моей Java.

Information:Gradle tasks [:assembleDebug] :preBuild UP-TO-DATE :preDebugBuild UP-TO-DATE :checkDebugManifest :CordovaLib:preBuild UP-TO-DATE :CordovaLib:preDebugBuild UP-TO-DATE :CordovaLib:compileDebugNdk UP-TO-DATE :CordovaLib:compileLint :CordovaLib:copyDebugLint UP-TO-DATE :CordovaLib:mergeDebugProguardFiles UP-TO-DATE :CordovaLib:packageDebugRenderscript UP-TO-DATE :CordovaLib:checkDebugManifest :CordovaLib:prepareDebugDependencies :CordovaLib:compileDebugRenderscript UP-TO-DATE :CordovaLib:generateDebugResValues UP-TO-DATE :CordovaLib:generateDebugResources UP-TO-DATE :CordovaLib:packageDebugResources UP-TO-DATE :CordovaLib:compileDebugAidl UP-TO-DATE :CordovaLib:generateDebugBuildConfig UP-TO-DATE :CordovaLib:mergeDebugShaders UP-TO-DATE :CordovaLib:compileDebugShaders UP-TO-DATE :CordovaLib:generateDebugAssets UP-TO-DATE :CordovaLib:mergeDebugAssets UP-TO-DATE :CordovaLib:processDebugManifest UP-TO-DATE :CordovaLib:processDebugResources UP-TO-DATE :CordovaLib:generateDebugSources UP-TO-DATE :CordovaLib:incrementalDebugJavaCompilationSafeguard UP-TO-DATE :CordovaLib:compileDebugJavaWithJavac UP-TO-DATE :CordovaLib:processDebugJavaRes UP-TO-DATE :CordovaLib:transformResourcesWithMergeJavaResForDebug UP-TO-DATE :CordovaLib:transformClassesAndResourcesWithSyncLibJarsForDebug UP-TO-DATE :CordovaLib:mergeDebugJniLibFolders UP-TO-DATE :CordovaLib:transformNative_libsWithMergeJniLibsForDebug UP-TO-DATE :CordovaLib:transformNative_libsWithSyncJniLibsForDebug UP-TO-DATE :CordovaLib:bundleDebug UP-TO-DATE :prepareAndroidCordovaLibUnspecifiedDebugLibrary UP-TO-DATE :prepareDebugDependencies :compileDebugAidl UP-TO-DATE :compileDebugRenderscript UP-TO-DATE :generateDebugBuildConfig UP-TO-DATE :mergeDebugShaders UP-TO-DATE :compileDebugShaders UP-TO-DATE :generateDebugAssets UP-TO-DATE :mergeDebugAssets UP-TO-DATE :generateDebugResValues UP-TO-DATE :generateDebugResources UP-TO-DATE :mergeDebugResources UP-TO-DATE :processDebugManifest UP-TO-DATE :processDebugResources UP-TO-DATE :generateDebugSources UP-TO-DATE :incrementalDebugJavaCompilationSafeguard :compileDebugJavaWithJavac :compileDebugJavaWithJavac - is not incremental (eg outputs have changed, no previous execution, etc.). Note: /Users/DevStarlight/Documents/Replit/platforms/android/src/org/apache/cordova/splashscreen/SplashScreen.java uses or overrides a deprecated API. Note: Recompile with -Xlint:deprecation for details. :compileDebugNdk UP-TO-DATE :compileDebugSources :prePackageMarkerForDebug :transformClassesWithDexForDebug To run dex in process, the Gradle daemon needs a larger heap. It currently has approximately 910 MB. For faster builds, increase the maximum heap size for the Gradle daemon to more than 2048 MB. To do this set org.gradle.jvmargs=-Xmx2048M in the project gradle.properties. For more information see https://docs.gradle.org/current/userguide/build_environment.html Error:Exception in thread "main" java.lang.UnsupportedClassVersionError: com/android/dx/command/Main : Unsupported major.minor version 52.0 Error: at java.lang.ClassLoader.defineClass1(Native Method) Error: at java.lang.ClassLoader.defineClass(ClassLoader.java:800) Error: at java.security.SecureClassLoader.defineClass(SecureClassLoader.java:142) Error: at java.net.URLClassLoader.defineClass(URLClassLoader.java:449) Error: at java.net.URLClassLoader.access$100(URLClassLoader.java:71) Error: at java.net.URLClassLoader$1.run(URLClassLoader.java:361) Error: at java.net.URLClassLoader$1.run(URLClassLoader.java:355) Error: at java.security.AccessController.doPrivileged(Native Method) Error: at java.net.URLClassLoader.findClass(URLClassLoader.java:354) Error: at java.lang.ClassLoader.loadClass(ClassLoader.java:425) Error: at sun.misc.Launcher$AppClassLoader.loadClass(Launcher.java:308) Error: at java.lang.ClassLoader.loadClass(ClassLoader.java:358) Error: at sun.launcher.LauncherHelper.checkAndLoadMain(LauncherHelper.java:482) Error:Exception in thread "main" java.lang.UnsupportedClassVersionError: com/android/dx/command/Main : Unsupported major.minor version 52.0 Error: at java.lang.ClassLoader.defineClass1(Native Method) Error: at java.lang.ClassLoader.defineClass(ClassLoader.java:800) Error: at java.security.SecureClassLoader.defineClass(SecureClassLoader.java:142) Error: at java.net.URLClassLoader.defineClass(URLClassLoader.java:449) Error: at java.net.URLClassLoader.access$100(URLClassLoader.java:71) Error: at java.net.URLClassLoader$1.run(URLClassLoader.java:361) Error: at java.net.URLClassLoader$1.run(URLClassLoader.java:355) Error: at java.security.AccessController.doPrivileged(Native Method) Error: at java.net.URLClassLoader.findClass(URLClassLoader.java:354) Error: at java.lang.ClassLoader.loadClass(ClassLoader.java:425) Error: at sun.misc.Launcher$AppClassLoader.loadClass(Launcher.java:308) Error: at java.lang.ClassLoader.loadClass(ClassLoader.java:358) Error: at sun.launcher.LauncherHelper.checkAndLoadMain(LauncherHelper.java:482) :transformClassesWithDexForDebug FAILED Error:Execution failed for task ':transformClassesWithDexForDebug'. > com.android.build.api.transform.TransformException: java.lang.RuntimeException: com.android.ide.common.process.ProcessException: java.util.concurrent.ExecutionException: com.android.ide.common.process.ProcessException: org.gradle.process.internal.ExecException: Process 'command '/Library/Java/JavaVirtualMachines/jdk1.7.0_79.jdk/Contents/Home/bin/java'' finished with non-zero exit value 1 Information:BUILD FAILED Information:Total time: 3.606 secs Information:29 errors Information:0 warnings Information:See complete output in console 

С моим Ubuntu он отлично работает, но с OSX он не работает.

Java-версия моего Ubuntu 16.04 – 1.7.0_80-b15 а мой OSX – 1.7.0_79 .

Кто-нибудь знает, что я могу сделать, чтобы решить эту проблему?

Solutions Collecting From Web of "Не удалось скомпилировать мой Android-проект"

С той же проблемой со вчерашнего дня.

Вам нужно будет установить JDK 1.8 отсюда . Я установил комплект 8u92.

После этого вам нужно будет обновить переменную среды JAVA_HOME. Чтобы обновить его только для проектов Cordova в Visual Studio, вы можете сделать это в настройках Visual Studio, как на скриншоте.

Возможности Visual Studio Cordova

Тогда все строит отлично.

Повеселись! 🙂

У меня была та же проблема, и я обнаружил, что я установил Java SDK, но не JRE. Переустановка SDK и выбор установки JRE, которая поставляется вместе с установщиком, решили для меня.