Intereting Posts
Владелец устройства на Android 5.0 (и другие) без корневых устройств, предоставление устройств NFC Пользовательский глобальный класс приложения разбивается на "android.app.Application не может быть отброшен в" Android – анимация масштабирования с использованием AnimatorSet Как предотвратить включение кнопки внутри объекта ListItem Могу ли я хранить данные на устройстве Android для сохранения между установками? Отладка с Android Studio застряла на «Ожидание отладчика» навсегда Какую версию Android sdk выпустить на рынок? Как установить приложение Android на реальном устройстве без публикации и Eclipse? Некоторое сбой хэширования файла, см. Журналы для подробностей Как установить пользовательский цвет / стиль ActionBar? Android Fabric TwitterCore логин без TwitterLoginButton Linux rt-patch для андроида? ListView getChildAt возвращает null для видимых детей Как узнать наименьшую ширину (sw) устройства Android? Android / SQLite: колонки Insert-Update для сохранения идентификатора

Не удается запустить приложение в Android Studio 2.0 Preview

Моя градация

// Top-level build file where you can add configuration options common to all sub-projects/modules. buildscript { repositories { jcenter() maven { url 'https://maven.fabric.io/public' } } dependencies { classpath 'com.android.tools.build:gradle:2.0.0-alpha1' classpath 'com.jakewharton.hugo:hugo-plugin:1.2.1' } } allprojects { repositories { mavenCentral() jcenter() maven { url 'https://maven.fabric.io/public' } maven { url 'http://dl.bintray.com/amulyakhare/maven' } } } 

График приложения –

 buildscript { repositories { maven { url 'https://maven.fabric.io/public' } } dependencies { classpath 'io.fabric.tools:gradle:1.19.2' } } apply plugin: 'com.android.application' repositories { maven { url 'https://maven.fabric.io/public' } maven { url "https://clojars.org/repo/"} maven { url "https://s3.amazonaws.com/repo.commonsware.com" } } apply plugin: 'com.jakewharton.hugo' apply plugin: 'io.fabric' android { compileSdkVersion 23 buildToolsVersion '23.0.2' defaultConfig { applicationId "***.***" minSdkVersion 14 targetSdkVersion 22 versionCode 5 versionName "1.5" } buildTypes { release { minifyEnabled false proguardFiles getDefaultProguardFile('proguard-android.txt'), 'proguard-rules.pro' } } packagingOptions { exclude 'META-INF/LICENSE.txt' exclude 'META-INF/NOTICE.txt' } signingConfigs { release { storeFile file('../keystore.jks') storePassword "***" keyAlias '***' keyPassword "***" } } buildTypes { debug { debuggable true zipAlignEnabled true signingConfig signingConfigs.release minifyEnabled false } release { debuggable false minifyEnabled false signingConfig signingConfigs.release } } } dependencies { compile fileTree(dir: 'libs', include: ['*.jar']) compile 'com.parse.bolts:bolts-android:1.+' compile 'com.parse:parsetwitterutils-android:1.10.3' compile 'com.parse:parse-android:1.+' compile 'jp.wasabeef:picasso-transformations:1.3.0' compile 'jp.co.cyberagent.android.gpuimage:gpuimage-library:1.3.0' compile 'com.android.support:appcompat-v7:23.1.1' compile 'com.android.support:design:23.1.1' compile 'com.squareup.retrofit:retrofit:1.9.0' compile 'com.octo.android.robospice:robospice:1.4.14' compile 'io.reactivex:rxjava:1.0.14' compile 'io.reactivex:rxandroid:0.25.0' compile 'de.greenrobot:eventbus:2.4.0' compile 'com.github.snowdream.android.util:log:1.2.0' compile 'com.jakewharton:butterknife:7.0.1' compile('com.crashlytics.sdk.android:crashlytics:2.5.2@aar') { transitive = true; } compile('com.digits.sdk.android:digits:1.9.1@aar') { transitive = true; } /* compile 'frankiesardo:icepick:3.0.2' provided 'frankiesardo:icepick-processor:3.0.2'*/ compile 'org.parceler:parceler-api:1.0.1' provided 'org.parceler:parceler:1.0.1' compile 'com.squareup.picasso:picasso:2.5.2' compile 'org.scribe:scribe:1.3.6' compile 'com.android.support:support-v13:23.1.1' compile 'com.facebook.android:facebook-android-sdk:4.1.0' compile 'com.pushtorefresh.storio:content-resolver:1.0.1' compile 'com.amulyakhare:com.amulyakhare.textdrawable:1.0.1' compile 'com.pkmmte.view:circularimageview:1.1' compile 'com.baoyz.pullrefreshlayout:library:1.0.1' compile 'com.commonsware.cwac:merge:1.1.+'//adapger merger for listview with two adapters compile 'com.google.android.gms:play-services-location:8.3.0' compile 'com.nostra13.universalimageloader:universal-image-loader:1.9.4' } 

Когда я пытаюсь запустить приложение в Android Studio 2.0 Preview, в окне сообщений появляется следующее сообщение:

 Information:Gradle tasks [:app:assembleDebug] :app:incrementalDebugBuildInfoGenerator :app:preBuild UP-TO-DATE :app:preDebugBuild :app:checkDebugManifest :app:preReleaseBuild UP-TO-DATE :app:prepareComAmulyakhareComAmulyakhareTextdrawable101Library UP-TO-DATE :app:prepareComAndroidSupportAppcompatV72311Library UP-TO-DATE :app:prepareComAndroidSupportDesign2311Library UP-TO-DATE :app:prepareComAndroidSupportRecyclerviewV72311Library UP-TO-DATE :app:prepareComAndroidSupportSupportV132311Library UP-TO-DATE :app:prepareComAndroidSupportSupportV42311Library UP-TO-DATE :app:prepareComBaoyzPullrefreshlayoutLibrary101Library UP-TO-DATE :app:prepareComCommonswareCwacMerge111Library UP-TO-DATE :app:prepareComCommonswareCwacSacklist102Library UP-TO-DATE :app:prepareComCrashlyticsSdkAndroidAnswers132Library UP-TO-DATE :app:prepareComCrashlyticsSdkAndroidBeta113Library UP-TO-DATE :app:prepareComCrashlyticsSdkAndroidCrashlytics252Library UP-TO-DATE :app:prepareComCrashlyticsSdkAndroidCrashlyticsCore235Library UP-TO-DATE :app:prepareComDigitsSdkAndroidDigits191Library UP-TO-DATE :app:prepareComFacebookAndroidFacebookAndroidSdk410Library UP-TO-DATE :app:prepareComGoogleAndroidGmsPlayServicesBase830Library UP-TO-DATE :app:prepareComGoogleAndroidGmsPlayServicesBasement830Library UP-TO-DATE :app:prepareComGoogleAndroidGmsPlayServicesLocation830Library UP-TO-DATE :app:prepareComGoogleAndroidGmsPlayServicesMaps830Library UP-TO-DATE :app:prepareComJakewhartonHugoHugoRuntime121Library UP-TO-DATE :app:prepareComPkmmteViewCircularimageview11Library UP-TO-DATE :app:prepareComTwitterSdkAndroidTwitterCore161Library UP-TO-DATE :app:prepareIoFabricSdkAndroidFabric137Library UP-TO-DATE :app:prepareJpWasabeefPicassoTransformations130Library UP-TO-DATE :app:prepareDebugDependencies :app:compileDebugAidl UP-TO-DATE :app:compileDebugRenderscript UP-TO-DATE :app:generateDebugBuildConfig UP-TO-DATE :app:processDebugManifest :app:injectDebugBootstrap Instrumented adam.youpick.common.YouPickApp with fast deploy :app:generateDebugAssets UP-TO-DATE :app:mergeDebugAssets UP-TO-DATE :app:generateDebugResValues UP-TO-DATE :app:generateDebugResources UP-TO-DATE :app:mergeDebugResources UP-TO-DATE :app:crashlyticsGenerateResourcesDebug :app:processDebugResources :app:generateDebugSources :app:compileDebugJavaWithJavac Note: Some input files use or override a deprecated API. Note: Recompile with -Xlint:deprecation for details. Note: Some input files use unchecked or unsafe operations. Note: Recompile with -Xlint:unchecked for details. :app:compileDebugNdk UP-TO-DATE :app:compileDebugSources :app:fastDeployDebugExtractor :app:generateDebugInstantRunAppInfo :app:transformClassesWithInstantRunVerifierForDebug :app:transformClassesWithInstantRunForDebug IncrementalSupportVisitor Visiting adam/youpick/BuildConfig IncrementalSupportVisitor Visiting adam/youpick/FragmentStack ... //HERE IS MANY ERRORS ABOUT "IncrementalSupportVisitor Visiting" IncrementalSupportVisitor Visiting adam/youpick/serviceLayer/network/api/yelp/model/YelpRequest :app:transformClassesWithInstant+restartDexForDebug :app:transformClasses_enhancedWithInstant+reloadDexForDebug :app:incrementalDebugSupportDex :app:transformClassesWithDexForDebug FAILED Error:Execution failed for task ':app:transformClassesWithDexForDebug'. > com.android.build.api.transform.TransformException: com.android.ide.common.process.ProcessException: org.gradle.process.internal.ExecException: Process 'command 'C:\Program Files\Java\jdk1.8.0_66\bin\java.exe'' finished with non-zero exit value 2 Information:BUILD FAILED Information:Total time: 3 mins 9.804 secs Information:1 error Information:0 warnings Information:See complete output in console 

ОБНОВИТЬ:

Но с classpath 'com.android.tools.build:gradle:1.2.3' приложение работает правильно

Как решить ошибку: IncrementalSupportVisitor Visiting с помощью gradle:2.0.0-alpha1 ?

Solutions Collecting From Web of "Не удается запустить приложение в Android Studio 2.0 Preview"

Из документации :

Здесь также есть некоторые известные проблемы, над которыми мы работаем: приложения, использующие устаревшие multi-dex (с minSdkVersion <21), с основным файлом dex рядом с пределом метода 65K, могут не создаваться. Для этого потребуется переработать приложение, чтобы освободить место в главном списке dex, уменьшив количество классов, необходимых в основном файле dex.

Кажется, что «Instant Run» не работает с Multi-dex pre 21.

Поэтому не используйте gradle:2.0.0-alpha1

У меня такая же ошибка раньше, я решил ошибку, обновив

targetSdkVersion = 23

Также я использую

classpath 'com.android.tools.build:gradle:2.0.0-alpha5'

С Android Studio Preview 5

Вы можете добавить multiDexEnabled true в defaultConfig

  defaultConfig { multiDexEnabled true } 

У меня была такая же проблема с моей версией Android Studio 2.0, и я исправил это, обновив плагин Gradle в новейшей версии. Вот как вы можете обновить его до последней версии

Nstant Run включен по умолчанию для проектов, созданных с помощью Android Gradle Plugin 2.0.0 или более поздней версии. Чтобы обновить существующий проект с последней версией плагина Gradle, перейдите в диалог настроек:

 On Mac, click Android Studio → Preferences On Windows and Linux, click File → Settings 

В диалоговом окне «Настройки / Настройки» перейдите к «Сборка, выполнение, развертывание →« Мгновенный запуск ». Нажмите ссылку «Обновить проект». При появлении запроса нажмите «ОК».

Введите описание изображения здесь